Reaction Details
TargetCoagulation factor X
LigandBDBM50295599
Substrate/Competitorn/a
Meas. Tech.ChEMBL_577597 (CHEMBL1059506)
Ki 93±n/a nM
Citation Zbinden, KGAnselm, LBanner, DWBenz, JBlasco, FDécoret, GHimber, JKuhn, BPanday, NRicklin, FRisch, PSchlatter, DStahl, MThomi, SUnger, RHaap, W Design of novel aminopyrrolidine factor Xa inhibitors from a screening hit. Eur J Med Chem44:2787-95 (2009) 
 
Coagulation factor X
Name:Coagulation factor X
Type:Enzyme
Mol. Mass.:54726.60
Organism:Homo sapiens (Human)
Description:n/a
Residue:488
BDBM50295599
NameBDBM50295599
Synonyms:(2S,4R)-4-(5-chlorothiophene-2-carboxamido)-N-(cyclopropylmethyl)-1-(2-(2-fluoro-4-(2-oxopyridin-1(2H)-yl)phenylamino)-2-oxoethyl)pyrrolidine-2-carboxamide CHEMBL563458
TypeSmall organic molecule
Emp. Form.C27H27ClFN5O4S
Mol. Mass.572.051
SMILESFc1cc(ccc1NC(=O)CN1C[C@@H](C[C@H]1C(=O)NCC1CC1)NC(=O)c1ccc(Cl)s1)-n1ccccc1=O