Reaction Details
TargetSteroid 17-alpha-hydroxylase/17,20 lyase
LigandBDBM31768
Substrate/Competitorn/a
Meas. Tech.ChEMBL_577742 (CHEMBL1052377)
IC50 2780±n/a nM
Citation Hille, UEHu, QVock, CNegri, MBartels, MMüller-Vieira, ULauterbach, THartmann, RW Novel CYP17 inhibitors: synthesis, biological evaluation, structure-activity relationships and modelling of methoxy- and hydroxy-substituted methyleneimidazolyl biphenyls. Eur J Med Chem44:2765-75 (2009) 
 
Steroid 17-alpha-hydroxylase/17,20 lyase
Name:Steroid 17-alpha-hydroxylase/17,20 lyase
Type:Enzyme
Mol. Mass.:57382.42
Organism:Homo sapiens (Human)
Description:E.coli expressing human CYP17
Residue:508
BDBM31768
NameBDBM31768
Synonyms:CHEMBL295698 Nizoral | Panfungol
TypeSmall organic molecule
Emp. Form.C26H28Cl2N4O4
Mol. Mass.531.431
SMILESCC(=O)N1CCN(CC1)c1ccc(OC[C@@H]2CO[C@](Cn3ccnc3)(O2)c2ccc(Cl)cc2Cl)cc1