Reaction Details
TargetMelanin-concentrating hormone receptor 1
LigandBDBM50295688
Substrate/Competitorn/a
Meas. Tech.ChEMBL_577916 (CHEMBL1059589)
IC50 1±n/a nM
Citation Ito, MSakamoto, TSuzuki, TEgashira, SMoriya, MIshihara, AIwaasa, HMatsushita, HNakase, KWallace, MADean, DSato, NTokita, SKanatani, A Identification and characterization of a selective radioligand for melanin-concentrating hormone 1-receptor (MCH1R). Bioorg Med Chem Lett19:2835-9 (2009) 
 
Melanin-concentrating hormone receptor 1
Name:Melanin-concentrating hormone receptor 1
Type:G Protein-Coupled Receptor (GPCR)
Mol. Mass.:45976.27
Organism:Homo sapiens (Human)
Description:Membranes from CHO-K1 cells stably expressing human MCH1R were used in assays.
Residue:422
BDBM50295688
NameBDBM50295688
Synonyms:CHEMBL556697 | N-(3-(3H-spiro[isobenzofuran-1,4'-piperidine]-1'-yl)propyl)-2-(3,4-difluorophenyl)-N-ethyl-2-(2-oxopyrrolidin-1-yl)acetamide
TypeSmall organic molecule
Emp. Form.C29H35F2N3O3
Mol. Mass.511.6033
SMILESCCN(CCCN1CCC2(CC1)OCc1ccccc21)C(=O)C(N1CCCC1=O)c1ccc(F)c(F)c1