Reaction Details
TargetMelanin-concentrating hormone receptor 1
LigandBDBM50295690
Substrate/Competitorn/a
Meas. Tech.ChEMBL_577918 (CHEMBL1059591)
Ki 0.5±n/a nM
Citation Ito, MSakamoto, TSuzuki, TEgashira, SMoriya, MIshihara, AIwaasa, HMatsushita, HNakase, KWallace, MADean, DSato, NTokita, SKanatani, A Identification and characterization of a selective radioligand for melanin-concentrating hormone 1-receptor (MCH1R). Bioorg Med Chem Lett19:2835-9 (2009) 
 
Melanin-concentrating hormone receptor 1
Name:Melanin-concentrating hormone receptor 1
Type:PROTEIN
Mol. Mass.:39133.74
Organism:Mus musculus
Description:ChEMBL_818502
Residue:353
BDBM50295690
NameBDBM50295690
Synonyms:(+/-)-2-(3,4-difluorophenyl)-N-ethyl-N-(3-(6-fluoro-3H-spiro[isobenzofuran-1,4''-piperidine]-1''-yl)propyl)-2-(4-(methylsulfonyl)-2-oxopiperazin-1-yl)acetamide CHEMBL538424 | CHEMBL538425
TypeSmall organic molecule
Emp. Form.C30H37F3N4O5S
Mol. Mass.622.699
SMILESCCN(CCCN1CCC2(CC1)OCc1ccc(F)cc21)C(=O)C(N1CCN(CC1=O)S(C)(=O)=O)c1ccc(F)c(F)c1