Reaction Details
TargetMelanin-concentrating hormone receptor 1
LigandBDBM50295693
Substrate/Competitorn/a
Meas. Tech.ChEMBL_577819 (CHEMBL1055470)
Ki 0.034±n/a nM
Citation Ito, MSakamoto, TSuzuki, TEgashira, SMoriya, MIshihara, AIwaasa, HMatsushita, HNakase, KWallace, MADean, DSato, NTokita, SKanatani, A Identification and characterization of a selective radioligand for melanin-concentrating hormone 1-receptor (MCH1R). Bioorg Med Chem Lett19:2835-9 (2009) 
 
Melanin-concentrating hormone receptor 1
Name:Melanin-concentrating hormone receptor 1
Type:G Protein-Coupled Receptor (GPCR)
Mol. Mass.:45976.27
Organism:Homo sapiens (Human)
Description:Membranes from CHO-K1 cells stably expressing human MCH1R were used in assays.
Residue:422
BDBM50295693
NameBDBM50295693
Synonyms:CHEMBL557629
TypeSmall organic molecule
Emp. Form.C109H162N30O25S4
Mol. Mass.2420.899
SMILESCSCC[C@H](NC(=O)[C@H](CC(O)=O)NC(=O)[C@H](Cc1ccccc1)NC(=O)[C@@H](N)CC(O)=O)C(=O)N[C@@H](CC(C)C)C(=O)N[C@@H](CCCN=C(N)N)C(=O)N[C@H]1CSSC[C@H](NC(=O)[C@@H]2CCCN2C(=O)[C@H](CCCN=C(N)N)NC(=O)[C@H](Cc2ccccc2)NC(=O)[C@@H](NC(=O)[C@H](CCCN=C(N)N)NC(=O)CNC(=O)[C@H](CC(C)C)NC(=O)[C@H](CCSC)NC1=O)C(C)C)C(=O)N[C@@H](Cc1c[nH]c2ccccc12)C(=O)N[C@@H](CCC(N)=O)CN[C@@H](Cc1ccc(O)cc1)C(O)=O