Reaction Details
TargetHistamine H1 receptor
LigandBDBM50295711
Substrate/Competitorn/a
Meas. Tech.ChEMBL_577960 (CHEMBL1059633)
IC50 124±n/a nM
Citation Kubota, KKurebayashi, HMiyachi, HTobe, MOnishi, MIsobe, Y Synthesis and structure-activity relationships of phenothiazine carboxylic acids having pyrimidine-dione as novel histamine H(1) antagonists. Bioorg Med Chem Lett19:2766-71 (2009) 
 
Histamine H1 receptor
Name:Histamine H1 receptor
Type:G Protein-Coupled Receptor (GPCR)
Mol. Mass.:55808.72
Organism:Homo sapiens (Human)
Description:Cell pellets from SK-N-MC cells transfected with human H1 receptor were used in binding assay.
Residue:487
BDBM50295711
NameBDBM50295711
Synonyms:10-(2-(4-(1,3-dimethyl-2,6-dioxo-1,2,3,6-tetrahydropyrimidin-4-yl)piperazin-1-yl)ethyl)-10H-phenothiazine-2-carboxylic acid | CHEMBL564168
TypeSmall organic molecule
Emp. Form.C25H27N5O4S
Mol. Mass.493.578
SMILESCn1c(cc(=O)n(C)c1=O)N1CCN(CCN2c3ccccc3Sc3ccc(cc23)C(O)=O)CC1