Reaction Details
TargetHistamine H1 receptor
LigandBDBM50295712
Substrate/Competitorn/a
Meas. Tech.ChEMBL_577960 (CHEMBL1059633)
IC50>500±n/a nM
Citation Kubota, KKurebayashi, HMiyachi, HTobe, MOnishi, MIsobe, Y Synthesis and structure-activity relationships of phenothiazine carboxylic acids having pyrimidine-dione as novel histamine H(1) antagonists. Bioorg Med Chem Lett19:2766-71 (2009) 
 
Histamine H1 receptor
Name:Histamine H1 receptor
Type:G Protein-Coupled Receptor (GPCR)
Mol. Mass.:55808.72
Organism:Homo sapiens (Human)
Description:Cell pellets from SK-N-MC cells transfected with human H1 receptor were used in binding assay.
Residue:487
BDBM50295712
NameBDBM50295712
Synonyms:10-(3-(4-(1,3-dimethyl-2,6-dioxo-1,2,3,6-tetrahydropyrimidin-4-yl)-1,4-diazepan-1-yl)propyl)-10H-phenothiazine-4-carboxylic acid | CHEMBL560517
TypeSmall organic molecule
Emp. Form.C27H31N5O4S
Mol. Mass.521.631
SMILESCn1c(cc(=O)n(C)c1=O)N1CCCN(CCCN2c3ccccc3Sc3c2cccc3C(O)=O)CC1