Reaction Details
TargetHistamine H1 receptor
LigandBDBM50295720
Substrate/Competitorn/a
Meas. Tech.ChEMBL_577960 (CHEMBL1059633)
IC50 41±n/a nM
Citation Kubota, KKurebayashi, HMiyachi, HTobe, MOnishi, MIsobe, Y Synthesis and structure-activity relationships of phenothiazine carboxylic acids having pyrimidine-dione as novel histamine H(1) antagonists. Bioorg Med Chem Lett19:2766-71 (2009) 
 
Histamine H1 receptor
Name:Histamine H1 receptor
Type:G Protein-Coupled Receptor (GPCR)
Mol. Mass.:55808.72
Organism:Homo sapiens (Human)
Description:Cell pellets from SK-N-MC cells transfected with human H1 receptor were used in binding assay.
Residue:487
BDBM50295720
NameBDBM50295720
Synonyms:2-(10-(3-(4-(1,3-dimethyl-2,6-dioxo-1,2,3,6-tetrahydropyrimidin-4-yl)-5,6-dihydropyridin-1(2H)-yl)propyl)-10H-phenothiazin-2-yl)acetic acid | CHEMBL551394
TypeSmall organic molecule
Emp. Form.C28H30N4O4S
Mol. Mass.518.627
SMILESCn1c(cc(=O)n(C)c1=O)C1=CCN(CCCN2c3ccccc3Sc3ccc(CC(O)=O)cc23)CC1