Reaction Details
TargetOxytocin receptor
LigandBDBM50295776
Substrate/Competitorn/a
Meas. Tech.ChEMBL_578145 (CHEMBL1059543)
Ki 14.6±n/a nM
Citation Brown, AEllis, DPearce, DRalph, MSciammetta, N Aryloxypyrazines as highly selective antagonists of Oxytocin. Bioorg Med Chem Lett19:2634-6 (2009) 
 
Oxytocin receptor
Name:Oxytocin receptor
Type:Enzyme Catalytic Domain
Mol. Mass.:42793.26
Organism:Homo sapiens (Human)
Description:Oxytocin OXTR HEK293::B2R9L7
Residue:389
BDBM50295776
NameBDBM50295776
Synonyms:2-(3-fluoro-2-methylphenoxy)-5-(4-(6-methoxypyridin-3-yl)-5-methyl-4H-1,2,4-triazol-3-yl)pyrazine | CHEMBL549494
TypeSmall organic molecule
Emp. Form.C20H17FN6O2
Mol. Mass.392.3864
SMILESCOc1ccc(cn1)-n1c(C)nnc1-c1cnc(Oc2cccc(F)c2C)cn1