Reaction Details
TargetTyrosine-protein kinase JAK3
LigandBDBM50295811
Substrate/Competitorn/a
Meas. Tech.ChEMBL_578283 (CHEMBL1053840)
IC50 1±n/a nM
Citation Wilson, LJMalaviya, RYang, CArgentieri, RWang, BChen, XMurray, WVCavender, D Synthetic staurosporines via a ring closing metathesis strategy as potent JAK3 inhibitors and modulators of allergic responses. Bioorg Med Chem Lett19:3333-8 (2009) 
 
Tyrosine-protein kinase JAK3
Name:Tyrosine-protein kinase JAK3
Type:Protein
Mol. Mass.:125111.08
Organism:Homo sapiens (Human)
Description:P52333
Residue:1124
BDBM50295811
NameBDBM50295811
Synonyms:12,13-[2-carboxymethyl-cis-2,3-dihydroxy)-1,4-butyl]-6,7,12,13-tetrahyhydro-5,7-dioxo-5H-indolo[2,3-a]pyrrolo[3,4-c]carbazole | CHEMBL564940
TypeSmall organic molecule
Emp. Form.C26H19N3O6
Mol. Mass.469.4456
SMILESCOC(=O)[C@]1(O)Cn2c3ccccc3c3c4C(=O)NC(=O)c4c4c5ccccc5n(C[C@H]1O)c4c23