Reaction Details
TargetGlycogen phosphorylase, muscle form
LigandBDBM50295857
Substrate/Competitorn/a
Meas. Tech.ChEMBL_578476 (CHEMBL1063135)
Ki 2400±n/a nM
Citation Tóth, MKun, SBokor, EBenltifa, MTallec, GVidal, SDocsa, TGergely, PSomsák, LPraly, JP Synthesis and structure-activity relationships of C-glycosylated oxadiazoles as inhibitors of glycogen phosphorylase. Bioorg Med Chem17:4773-85 (2009) 
 
Glycogen phosphorylase, muscle form
Name:Glycogen phosphorylase, muscle form
Type:Enzyme
Mol. Mass.:97296.32
Organism:Oryctolagus cuniculus (rabbit)
Description:Phosphorylation of Ser-15 converts phosphorylase B (unphosphorylated) to phosphorylase A.
Residue:843
BDBM50295857
NameBDBM50295857
Synonyms:5-(beta-D-Glucopyranosyl)-3-(2-naphthyl)-1,2,4-oxadiazole | CHEMBL549843
TypeSmall organic molecule
Emp. Form.C18H18N2O6
Mol. Mass.358.3453
SMILESOC[C@H]1O[C@H]([C@H](O)[C@@H](O)[C@@H]1O)c1nc(no1)-c1ccc2ccccc2c1