Reaction Details
TargetD(2) dopamine receptor
LigandBDBM55121
Substrate/Competitorn/a
Meas. Tech.ChEMBL_578484 (CHEMBL1063143)
EC50 1425±n/a nM
Citation Herm, LBerényi, SVonk, ARinken, ASipos, A N-Substituted-2-alkyl- and 2-arylnorapomorphines: novel, highly active D2 agonists. Bioorg Med Chem17:4756-62 (2009) 
 
D(2) dopamine receptor
Name:D(2) dopamine receptor
Type:G Protein-Coupled Receptor (GPCR)
Mol. Mass.:50931.60
Organism:Rattus norvegicus (rat)
Description:P61169
Residue:444
BDBM55121
NameBDBM55121
Synonyms:3-HYDROXYTYRAMINE HYDROCHLORIDE 4-(2-aminoethyl)pyrocatechol;hydrochloride Dopamine SMR000059081 | cid_65340
TypeSmall organic molecule
Emp. Form.C8H11NO2
Mol. Mass.153.1784
SMILESNCCc1ccc(O)c(O)c1