Reaction Details
TargetGlycogen synthase kinase-3 beta
LigandBDBM50295901
Substrate/Competitorn/a
Meas. Tech.ChEMBL_578963 (CHEMBL1064034)
IC50>73340±n/a nM
Citation Ye, QXu, GLv, DCheng, ZLi, JHu, Y Synthesis and biological evaluation of novel 4-azaindolyl-indolyl-maleimides as glycogen synthase kinase-3beta (GSK-3beta) inhibitors. Bioorg Med Chem17:4302-12 (2009) 
 
Glycogen synthase kinase-3 beta
Name:Glycogen synthase kinase-3 beta
Type:Enzyme
Mol. Mass.:46756.38
Organism:Homo sapiens (Human)
Description:P49841
Residue:420
BDBM50295901
NameBDBM50295901
Synonyms:3-(1-(3-(1H-Imidazol-1-yl)propyl)-1H-indol-3-yl)-1-phenyl-4-(1H-pyrrolo[3,2-b]pyridin-1-yl)-1H-pyrrole-2,5-dione | CHEMBL560467
TypeSmall organic molecule
Emp. Form.C31H24N6O2
Mol. Mass.512.5613
SMILESO=C1N(C(=O)C(=C1c1cn(CCCn2ccnc2)c2ccccc12)n1ccc2ncccc12)c1ccccc1