Reaction Details
TargetInhibitor of nuclear factor kappa-B kinase subunit beta
LigandBDBM50295902
Substrate/Competitorn/a
Meas. Tech.ChEMBL_578965 (CHEMBL1064036)
IC50>40000±n/a nM
Citation Ye, QXu, GLv, DCheng, ZLi, JHu, Y Synthesis and biological evaluation of novel 4-azaindolyl-indolyl-maleimides as glycogen synthase kinase-3beta (GSK-3beta) inhibitors. Bioorg Med Chem17:4302-12 (2009) 
 
Inhibitor of nuclear factor kappa-B kinase subunit beta
Name:Inhibitor of nuclear factor kappa-B kinase subunit beta
Type:Serine/threonine-protein kinase
Mol. Mass.:86554.39
Organism:Homo sapiens (Human)
Description:GST-tagged IKK-2 was expressed in High Five cells and purified.
Residue:756
BDBM50295902
NameBDBM50295902
Synonyms:3-(1-Methyl-1H-pyrrolo[3,2-b]pyridin-3-yl)-4-(1-(3-morpholinopropyl)-1H-indol-3-yl)-1H-pyrrole-2,5-dione | CHEMBL552265
TypeSmall organic molecule
Emp. Form.C27H27N5O3
Mol. Mass.469.535
SMILESCn1cc(C2=C(C(=O)NC2=O)c2cn(CCCN3CCOCC3)c3ccccc23)c2ncccc12