Reaction Details
TargetAurora kinase A
LigandBDBM50295904
Substrate/Competitorn/a
Meas. Tech.ChEMBL_578966 (CHEMBL1064037)
IC50>40000±n/a nM
Citation Ye, QXu, GLv, DCheng, ZLi, JHu, Y Synthesis and biological evaluation of novel 4-azaindolyl-indolyl-maleimides as glycogen synthase kinase-3beta (GSK-3beta) inhibitors. Bioorg Med Chem17:4302-12 (2009) 
 
Aurora kinase A
Name:Aurora kinase A
Type:Serine/threonine-protein kinase
Mol. Mass.:45830.98
Organism:Homo sapiens (Human)
Description:O14965
Residue:403
BDBM50295904
NameBDBM50295904
Synonyms:3-(1-(2-(1H-Imidazol-1-yl)ethyl)-1H-indol-3-yl)-4-(1Hpyrrolo[3,2-b]pyridin-1-yl)-1H-pyrrole-2,5-dione | CHEMBL558512
TypeSmall organic molecule
Emp. Form.C24H18N6O2
Mol. Mass.422.4387
SMILESO=C1NC(=O)C(=C1c1cn(CCn2ccnc2)c2ccccc12)n1ccc2ncccc12