Reaction Details
TargetGlycogen synthase kinase-3 beta
LigandBDBM50295905
Substrate/Competitorn/a
Meas. Tech.ChEMBL_578963 (CHEMBL1064034)
IC50 30600±n/a nM
Citation Ye, QXu, GLv, DCheng, ZLi, JHu, Y Synthesis and biological evaluation of novel 4-azaindolyl-indolyl-maleimides as glycogen synthase kinase-3beta (GSK-3beta) inhibitors. Bioorg Med Chem17:4302-12 (2009) 
 
Glycogen synthase kinase-3 beta
Name:Glycogen synthase kinase-3 beta
Type:Enzyme
Mol. Mass.:46756.38
Organism:Homo sapiens (Human)
Description:P49841
Residue:420
BDBM50295905
NameBDBM50295905
Synonyms:3-(1H-Indol-3-yl)-4-(1H-pyrrolo[3,2-b]pyridin-1-yl)-1Hpyrrole-2,5-dione | CHEMBL563143
TypeSmall organic molecule
Emp. Form.C19H12N4O2
Mol. Mass.328.3242
SMILESO=C1NC(=O)C(=C1c1c[nH]c2ccccc12)n1ccc2ncccc12