Reaction Details
TargetNeuronal acetylcholine receptor subunit alpha-2
LigandBDBM50295958
Substrate/Competitorn/a
Meas. Tech.ChEMBL_578992 (CHEMBL1061441)
Ki 0.05±n/a nM
Citation Gao, YRavert, HTKuwabara, HXiao, YEndres, CJHilton, JHolt, DPKumar, AAlexander, MWong, DFDannals, RFHorti, AG Synthesis and biological evaluation of novel carbon-11 labeled pyridyl ethers: candidate ligands for in vivo imaging of alpha4beta2 nicotinic acetylcholine receptors (alpha4beta2-nAChRs) in the brain with positron emission tomography. Bioorg Med Chem17:4367-77 (2009) 
 
Neuronal acetylcholine receptor subunit alpha-2
Name:Neuronal acetylcholine receptor subunit alpha-2
Type:Enzyme
Mol. Mass.:58597.25
Organism:Rattus norvegicus (Rat)
Description:P12389
Residue:511
BDBM50295958
NameBDBM50295958
Synonyms:(S)-2-chloro-2'-fluoro-5-((1-methylpyrrolidin-2-yl)methoxy)-3,4'-bipyridine | CHEMBL552408
TypeSmall organic molecule
Emp. Form.C16H17ClFN3O
Mol. Mass.321.777
SMILESCN1CCC[C@H]1COc1cnc(Cl)c(c1)-c1ccnc(F)c1