Reaction Details
TargetNeuronal acetylcholine receptor subunit alpha-2
LigandBDBM50295955
Substrate/Competitorn/a
Meas. Tech.ChEMBL_578993 (CHEMBL1061442)
Ki 4.1±n/a nM
Citation Gao, YRavert, HTKuwabara, HXiao, YEndres, CJHilton, JHolt, DPKumar, AAlexander, MWong, DFDannals, RFHorti, AG Synthesis and biological evaluation of novel carbon-11 labeled pyridyl ethers: candidate ligands for in vivo imaging of alpha4beta2 nicotinic acetylcholine receptors (alpha4beta2-nAChRs) in the brain with positron emission tomography. Bioorg Med Chem17:4367-77 (2009) 
 
Neuronal acetylcholine receptor subunit alpha-2
Name:Neuronal acetylcholine receptor subunit alpha-2
Type:Enzyme
Mol. Mass.:58597.25
Organism:Rattus norvegicus (Rat)
Description:P12389
Residue:511
BDBM50295955
NameBDBM50295955
Synonyms:5-(((S)-Pyrrolidin-2-yl)methoxy)-3-((6-chloropyridin-3-yl)methoxy)-2-chloropyridine | CHEMBL558513
TypeSmall organic molecule
Emp. Form.C15H15Cl2N3O2
Mol. Mass.340.205
SMILESClc1ccc(Oc2cc(OC[C@@H]3CCCN3)cnc2Cl)cn1