Reaction Details
TargetNeuronal acetylcholine receptor subunit alpha-3
LigandBDBM50066788
Substrate/Competitorn/a
Meas. Tech.ChEMBL_578994 (CHEMBL1061443)
Ki 3±n/a nM
Citation Gao, YRavert, HTKuwabara, HXiao, YEndres, CJHilton, JHolt, DPKumar, AAlexander, MWong, DFDannals, RFHorti, AG Synthesis and biological evaluation of novel carbon-11 labeled pyridyl ethers: candidate ligands for in vivo imaging of alpha4beta2 nicotinic acetylcholine receptors (alpha4beta2-nAChRs) in the brain with positron emission tomography. Bioorg Med Chem17:4367-77 (2009) 
 
Neuronal acetylcholine receptor subunit alpha-3
Name:Neuronal acetylcholine receptor subunit alpha-3
Type:Enzyme
Mol. Mass.:56995.52
Organism:Rattus norvegicus (Rat)
Description:P04757
Residue:499
BDBM50066788
NameBDBM50066788
Synonyms:(S)-3-(azetidin-2-ylmethoxy)-2-fluoropyridine CHEMBL308538
TypeSmall organic molecule
Emp. Form.C9H11FN2O
Mol. Mass.182.1948
SMILESFc1ncccc1OC[C@@H]1CCN1