Reaction Details
TargetNeuronal acetylcholine receptor subunit alpha-4
LigandBDBM50295953
Substrate/Competitorn/a
Meas. Tech.ChEMBL_578998 (CHEMBL1061447)
Ki 1.1±n/a nM
Citation Gao, YRavert, HTKuwabara, HXiao, YEndres, CJHilton, JHolt, DPKumar, AAlexander, MWong, DFDannals, RFHorti, AG Synthesis and biological evaluation of novel carbon-11 labeled pyridyl ethers: candidate ligands for in vivo imaging of alpha4beta2 nicotinic acetylcholine receptors (alpha4beta2-nAChRs) in the brain with positron emission tomography. Bioorg Med Chem17:4367-77 (2009) 
 
Neuronal acetylcholine receptor subunit alpha-4
Name:Neuronal acetylcholine receptor subunit alpha-4
Type:Enzyme
Mol. Mass.:70196.44
Organism:Rattus norvegicus (Rat)
Description:P09483
Residue:630
BDBM50295953
NameBDBM50295953
Synonyms:2-Chloro-3-(2-fluoro-4-(pyridinyl)methoxy)-5-(2-(S)-pyrrolidinyl)methoxy)-pyridine | CHEMBL560788
TypeSmall organic molecule
Emp. Form.C16H17ClFN3O2
Mol. Mass.337.776
SMILESFc1cc(COc2cc(OC[C@@H]3CCCN3)cnc2Cl)ccn1