Reaction Details
TargetNeuronal acetylcholine receptor subunit alpha-4
LigandBDBM50295959
Substrate/Competitorn/a
Meas. Tech.ChEMBL_579000 (CHEMBL1061449)
Ki 0.028±n/a nM
Citation Gao, YRavert, HTKuwabara, HXiao, YEndres, CJHilton, JHolt, DPKumar, AAlexander, MWong, DFDannals, RFHorti, AG Synthesis and biological evaluation of novel carbon-11 labeled pyridyl ethers: candidate ligands for in vivo imaging of alpha4beta2 nicotinic acetylcholine receptors (alpha4beta2-nAChRs) in the brain with positron emission tomography. Bioorg Med Chem17:4367-77 (2009) 
 
Neuronal acetylcholine receptor subunit alpha-4
Name:Neuronal acetylcholine receptor subunit alpha-4
Type:Enzyme
Mol. Mass.:70196.44
Organism:Rattus norvegicus (Rat)
Description:P09483
Residue:630
BDBM50295959
NameBDBM50295959
Synonyms:(S)-2-chloro-5-((1-methylpyrrolidin-2-yl)methoxy)-3-(2-(pyridin-4-yl)vinyl)pyridine | CHEMBL562523
TypeSmall organic molecule
Emp. Form.C18H20ClN3O
Mol. Mass.329.824
SMILESCN1CCC[C@H]1COc1cnc(Cl)c(\C=C\c2ccncc2)c1