Reaction Details
TargetSerine/threonine-protein kinase Sgk1
LigandBDBM50296011
Substrate/Competitorn/a
Meas. Tech.ChEMBL_579228 (CHEMBL1058022)
IC50 580±n/a nM
Citation Hammond, MWashburn, DGHoang, HTManns, SFrazee, JSNakamura, HPatterson, JRTrizna, WWu, CAzzarano, LMNagilla, RNord, MTrejo, RHead, MSZhao, BSmallwood, AMHightower, KLaping, NJSchnackenberg, CGThompson, SK Design and synthesis of orally bioavailable serum and glucocorticoid-regulated kinase 1 (SGK1) inhibitors. Bioorg Med Chem Lett19:4441-5 (2009) 
 
Serine/threonine-protein kinase Sgk1
Name:Serine/threonine-protein kinase Sgk1
Type:Other Protein Type
Mol. Mass.:48954.40
Organism:Homo sapiens (Human)
Description:Recombinant human SGK-1 enzyme produced in a baculovirus system.
Residue:431
BDBM50296011
NameBDBM50296011
Synonyms:2-cyclopentyl-4-(5-phenyl-1H-pyrrolo[2,3-b]pyridin-3-yl)benzoic acid | CHEMBL558642
TypeSmall organic molecule
Emp. Form.C25H22N2O2
Mol. Mass.382.4544
SMILESOC(=O)c1ccc(cc1C1CCCC1)-c1c[nH]c2ncc(cc12)-c1ccccc1