Reaction Details
TargetMelanin-concentrating hormone receptor 1
LigandBDBM50296017
Substrate/Competitorn/a
Meas. Tech.ChEMBL_579351 (CHEMBL1063192)
IC50 17±n/a nM
Citation Berglund, SEgner, BJGradén, HGradén, JMorgan, DGInghardt, TGiordanetto, F Optimization of 2-piperidin-4-yl-acetamides as melanin-concentrating hormone receptor 1 (MCH-R1) antagonists: Designing out hERG inhibition. Bioorg Med Chem Lett19:4268-73 (2009) 
 
Melanin-concentrating hormone receptor 1
Name:Melanin-concentrating hormone receptor 1
Type:G Protein-Coupled Receptor (GPCR)
Mol. Mass.:45976.27
Organism:Homo sapiens (Human)
Description:Membranes from CHO-K1 cells stably expressing human MCH1R were used in assays.
Residue:422
BDBM50296017
NameBDBM50296017
Synonyms:CHEMBL538936 | N-(bis(4-fluorophenyl)methyl)-2-(1-((1-(5-(trifluoromethyl)pyridin-2-yl)-1H-pyrrol-3-yl)methyl)piperidin-4-yl)acetamide
TypeSmall organic molecule
Emp. Form.C31H29F5N4O
Mol. Mass.568.5802
SMILESFc1ccc(cc1)C(NC(=O)CC1CCN(Cc2ccn(c2)-c2ccc(cn2)C(F)(F)F)CC1)c1ccc(F)cc1