Reaction Details
TargetHeat shock factor protein 1
LigandBDBM31044
Substrate/Competitorn/a
Meas. Tech.ChEMBL_579378 (CHEMBL1063219)
EC50 5100±n/a nM
Citation Zhou, YWei, LBrady, TPMurali Mohan Redddy, PSNguyen, TChen, JAu, QYoon, ISYip, GZhang, BBarber, JRNg, SC Pyrimido[5,4-e][1,2,4]triazine-5,7(1H,6H)-dione derivatives as novel small molecule chaperone amplifiers. Bioorg Med Chem Lett19:4303-7 (2009) 
 
Heat shock factor protein 1
Name:Heat shock factor protein 1
Type:PROTEIN
Mol. Mass.:57244.20
Organism:Homo sapiens (Human)
Description:ChEMBL_1512556
Residue:529
BDBM31044
NameBDBM31044
Synonyms:1-Ethyl-6-methyl-3-thiophen-2-yl-1H-pyrimido[5,4-e][1,2,4]triazine-5,7-dione 1-ethyl-6-methyl-3-thiophen-2-yl-pyrimido[5,4-e][1,2,4]triazine-5,7-dione MLS000033110 US9073941, 610 | cid_653297
TypeSmall organic molecule
Emp. Form.C12H11N5O2S
Mol. Mass.289.313
SMILESCCn1nc(nc2c1nc(=O)n(C)c2=O)-c1cccs1