Reaction Details
TargetHistamine H2 receptor
LigandBDBM50296171
Substrate/Competitorn/a
Meas. Tech.ChEMBL_579544 (CHEMBL1062332)
IC50>10000±n/a nM
Citation Sasaki, TTakahashi, TNagase, TMizutani, TIto, SMitobe, YMiyamoto, YKanesaka, MYoshimoto, RTanaka, TTakenaga, NTokita, SSato, N Synthesis, structure-activity relationships, and biological profiles of a dihydrobenzoxathiin class of histamine H(3) receptor inverse agonists. Bioorg Med Chem Lett19:4232-6 (2009) 
 
Histamine H2 receptor
Name:Histamine H2 receptor
Type:G Protein-Coupled Receptor (GPCR)
Mol. Mass.:40115.31
Organism:Homo sapiens (Human)
Description:n/a
Residue:359
BDBM50296171
NameBDBM50296171
Synonyms:1-{3-[4-((2S,3S)-8-Methoxy-3-methyl-4,4-dioxo-3,4-dihydro-2H-4lambda*6*-benzo[1,4]oxathiin-2-yl)-phenoxy]-propyl}-pyrrolidine | CHEMBL560386
TypeSmall organic molecule
Emp. Form.C23H29NO5S
Mol. Mass.431.545
SMILESCOc1cccc2c1O[C@H]([C@H](C)S2(=O)=O)c1ccc(OCCCN2CCCC2)cc1