Reaction Details
TargetHistamine H3 receptor
LigandBDBM50296176
Substrate/Competitorn/a
Meas. Tech.ChEMBL_579538 (CHEMBL1061547)
IC50 0.21±n/a nM
Citation Sasaki, TTakahashi, TNagase, TMizutani, TIto, SMitobe, YMiyamoto, YKanesaka, MYoshimoto, RTanaka, TTakenaga, NTokita, SSato, N Synthesis, structure-activity relationships, and biological profiles of a dihydrobenzoxathiin class of histamine H(3) receptor inverse agonists. Bioorg Med Chem Lett19:4232-6 (2009) 
 
Histamine H3 receptor
Name:Histamine H3 receptor
Type:G Protein-Coupled Receptor (GPCR)
Mol. Mass.:48691.47
Organism:Homo sapiens (Human)
Description:Binding assays were using CHO cells stably expressing hH3R receptors.
Residue:445
BDBM50296176
NameBDBM50296176
Synonyms:(+/-)-(R)-1-{3-[4-(8-Methoxy-3-methyl-4,4-dioxo-3,4-dihydro-2H-4lambda*6*-benzo[1,4]oxathiin-2-yl)-phenoxy]-propyl}-2-methyl-pyrrolidine | CHEMBL560863
TypeSmall organic molecule
Emp. Form.C24H31NO5S
Mol. Mass.445.572
SMILESCOc1cccc2c1OC(C(C)S2(=O)=O)c1ccc(OCCCN2CCC[C@H]2C)cc1