Reaction Details
TargetMatrilysin
LigandBDBM50070942
Substrate/Competitorn/a
Meas. Tech.ChEMBL_579665 (CHEMBL1064085)
IC50 21500±n/a nM
Citation Aihara, YYoshida, AFuruta, TWakimoto, TAkizawa, TKonishi, MKan, T Regioselective synthesis of methylated epigallocatechin gallate via nitrobenzenesulfonyl (Ns) protecting group. Bioorg Med Chem Lett19:4171-4 (2009) 
 
Matrilysin
Name:Matrilysin
Type:Enzyme
Mol. Mass.:29681.54
Organism:Homo sapiens (Human)
Description:P09237
Residue:267
BDBM50070942
NameBDBM50070942
Synonyms:(-)-Epigallocatechin gallate (-)-epigallocatechin 3-gallate CHEMBL297453 Epigallocatechin 3-gallate cid_65064
TypeSmall organic molecule
Emp. Form.C22H18O11
Mol. Mass.458.3717
SMILESOc1cc(O)c2C[C@@H](OC(=O)c3cc(O)c(O)c(O)c3)[C@H](Oc2c1)c1cc(O)c(O)c(O)c1