Reaction Details
TargetHydroxycarboxylic acid receptor 3
LigandBDBM50414500
Substrate/Competitorn/a
Meas. Tech.ChEMBL_579670 (CHEMBL1064090)
EC50 5623±n/a nM
Citation Skinner, PJWebb, PJSage, CRDang, THPride, CCChen, RTamura, SYRichman, JGConnolly, DTSemple, G 5-N,N-Disubstituted 5-aminopyrazole-3-carboxylic acids are highly potent agonists of GPR109b. Bioorg Med Chem Lett19:4207-9 (2009) 
 
Hydroxycarboxylic acid receptor 3
Name:Hydroxycarboxylic acid receptor 3
Type:Enzyme Catalytic Domain
Mol. Mass.:44498.06
Organism:Homo sapiens (Human)
Description:GPR109B 0 HUMAN::P49019
Residue:387
BDBM50414500
NameBDBM50414500
Synonyms:CHEMBL557298
TypeSmall organic molecule
Emp. Form.C20H21N3O2
Mol. Mass.335.3996
SMILESOC(=O)c1cc([nH]n1)N(CCc1ccccc1)CCc1ccccc1