Reaction Details
TargetStearoyl-CoA desaturase
LigandBDBM50296295
Substrate/Competitorn/a
Meas. Tech.ChEMBL_577394 (CHEMBL1056246)
IC50 0.3±n/a nM
Citation Uto, YOgata, TKiyotsuka, YMiyazawa, YUeno, YKurata, HDeguchi, TYamada, MWatanabe, NTakagi, TWakimoto, SOkuyama, RKonishi, MKurikawa, NKono, KOsumi, J Novel and potent inhibitors of stearoyl-CoA desaturase-1. Part II: Identification of 4-ethylamino-3-(2-hydroxyethoxy)-N-[5-(3-trifluoromethylbenzyl)thiazol-2-yl]benzamide and its biological evaluation. Bioorg Med Chem Lett19:4159-66 (2009) 
 
Stearoyl-CoA desaturase
Name:Stearoyl-CoA desaturase
Type:Enzyme
Mol. Mass.:41537.27
Organism:Homo sapiens (Human)
Description:O00767
Residue:359
BDBM50296295
NameBDBM50296295
Synonyms:CHEMBL552173 | N-(5-(3,5-bis(trifluoromethyl)benzyl)thiazol-2-yl)-3-(2-hydroxyethoxy)-4-methoxybenzamide
TypeSmall organic molecule
Emp. Form.C22H18F6N2O4S
Mol. Mass.520.445
SMILESCOc1ccc(cc1OCCO)C(=O)Nc1ncc(Cc2cc(cc(c2)C(F)(F)F)C(F)(F)F)s1