Reaction Details
TargetReceptor-type tyrosine-protein phosphatase F
LigandBDBM50296375
Substrate/Competitorn/a
Meas. Tech.ChEMBL_580554 (CHEMBL1054000)
IC50 380±n/a nM
Citation Lakshminarayana, NRajendra Prasad, YGharat, LThomas, ARavikumar, PNarayanan, SSrinivasan, CVGopalan, B Synthesis and evaluation of some novel isochroman carboxylic acid derivatives as potential anti-diabetic agents. Eur J Med Chem44:3147-57 (2009) 
 
Receptor-type tyrosine-protein phosphatase F
Name:Receptor-type tyrosine-protein phosphatase F
Type:Protein
Mol. Mass.:212869.85
Organism:Homo sapiens (Human)
Description:P10586
Residue:1907
BDBM50296375
NameBDBM50296375
Synonyms:(3S)-6-[4-(2,2-Dimethyl-1,3-dithiolan-4-yl)butylcarboxamido]-isochroman-3-carboxylic acid | CHEMBL564699
TypeSmall organic molecule
Emp. Form.C20H27NO4S2
Mol. Mass.409.563
SMILESCC1(C)SCC(CCCCC(=O)Nc2ccc3CO[C@@H](Cc3c2)C(O)=O)S1