Reaction Details
TargetReceptor-type tyrosine-protein phosphatase F
LigandBDBM50296386
Substrate/Competitorn/a
Meas. Tech.ChEMBL_580554 (CHEMBL1054000)
IC50 4368±n/a nM
Citation Lakshminarayana, NRajendra Prasad, YGharat, LThomas, ARavikumar, PNarayanan, SSrinivasan, CVGopalan, B Synthesis and evaluation of some novel isochroman carboxylic acid derivatives as potential anti-diabetic agents. Eur J Med Chem44:3147-57 (2009) 
 
Receptor-type tyrosine-protein phosphatase F
Name:Receptor-type tyrosine-protein phosphatase F
Type:Protein
Mol. Mass.:212869.85
Organism:Homo sapiens (Human)
Description:P10586
Residue:1907
BDBM50296386
NameBDBM50296386
Synonyms:(3S)-7-{4-[(4R)-1,3-Dithian-4-yl]butylcarboxamido}-isochroman-3-carboxylic acid | CHEMBL551671
TypeSmall organic molecule
Emp. Form.C19H25NO4S2
Mol. Mass.395.536
SMILESOC(=O)[C@@H]1Cc2ccc(NC(=O)CCCC[C@@H]3CCSCS3)cc2CO1