Reaction Details
TargetCarboxypeptidase A1
LigandBDBM50121929
Substrate/Competitorn/a
Meas. Tech.ChEMBL_580787 (CHEMBL1059769)
Ki 500±n/a nM
Citation Fernández, DAvilés, FXVendrell, J A new type of five-membered heterocyclic inhibitors of basic metallocarboxypeptidases. Eur J Med Chem44:3266-71 (2009) 
 
Carboxypeptidase A1
Name:Carboxypeptidase A1
Type:Enzyme
Mol. Mass.:47073.90
Organism:Bos taurus (bovine)
Description:From Sigma-Aldrich Co.
Residue:419
BDBM50121929
NameBDBM50121929
Synonyms:(phenylmethyl)butanedioic acid 2-benzylsuccinic acid alpha-benzylsuccinic acid beta-carboxybenzenebutanoic acid
TypeSmall organic molecule
Emp. Form.C11H12O4
Mol. Mass.208.2106
SMILESOC(=O)CC(Cc1ccccc1)C(O)=O