Reaction Details
TargetCarboxypeptidase B
LigandBDBM50296414
Substrate/Competitorn/a
Meas. Tech.ChEMBL_580786 (CHEMBL1059768)
Ki 3600±n/a nM
Citation Fernández, DAvilés, FXVendrell, J A new type of five-membered heterocyclic inhibitors of basic metallocarboxypeptidases. Eur J Med Chem44:3266-71 (2009) 
 
Carboxypeptidase B
Name:Carboxypeptidase B
Synonyms:CPB
Type:Enzyme
Mol. Mass.:48382.46
Organism:Helicoverpa zea (Corn earworm moth) (Heliothis zea)
Description:Q3T905
Residue:429
BDBM50296414
NameBDBM50296414
TypeSmall organic molecule
Emp. Form.C20H17ClN4O2S2
Mol. Mass.444.958
SMILESCOc1cccc(CSc2nnc(Cc3csc(Nc4cccc(Cl)c4)n3)o2)c1