Reaction Details
TargetCarboxypeptidase B
LigandBDBM50296422
Substrate/Competitorn/a
Meas. Tech.ChEMBL_580786 (CHEMBL1059768)
Ki 12000±n/a nM
Citation Fernández, DAvilés, FXVendrell, J A new type of five-membered heterocyclic inhibitors of basic metallocarboxypeptidases. Eur J Med Chem44:3266-71 (2009) 
 
Carboxypeptidase B
Name:Carboxypeptidase B
Synonyms:CPB
Type:Enzyme
Mol. Mass.:48382.46
Organism:Helicoverpa zea (Corn earworm moth) (Heliothis zea)
Description:Q3T905
Residue:429
BDBM50296422
NameBDBM50296422
TypeSmall organic molecule
Emp. Form.C18H15ClN2O3S
Mol. Mass.374.841
SMILESCc1ccc(cc1)C(=O)CSc1nnc(COc2ccc(Cl)cc2)o1