Reaction Details
TargetCarboxypeptidase B
LigandBDBM50296423
Substrate/Competitorn/a
Meas. Tech.ChEMBL_580786 (CHEMBL1059768)
Ki 12600±n/a nM
Citation Fernández, DAvilés, FXVendrell, J A new type of five-membered heterocyclic inhibitors of basic metallocarboxypeptidases. Eur J Med Chem44:3266-71 (2009) 
 
Carboxypeptidase B
Name:Carboxypeptidase B
Synonyms:CPB
Type:Enzyme
Mol. Mass.:48382.46
Organism:Helicoverpa zea (Corn earworm moth) (Heliothis zea)
Description:Q3T905
Residue:429
BDBM50296423
NameBDBM50296423
TypeSmall organic molecule
Emp. Form.C20H18ClN5O3S
Mol. Mass.443.907
SMILESCc1cc(ccc1-n1cnnn1)S(=O)(=O)N(Cc1ccco1)Cc1ccccc1Cl