Reaction Details
TargetCarboxypeptidase B
LigandBDBM50296428
Substrate/Competitorn/a
Meas. Tech.ChEMBL_580786 (CHEMBL1059768)
Ki 19700±n/a nM
Citation Fernández, DAvilés, FXVendrell, J A new type of five-membered heterocyclic inhibitors of basic metallocarboxypeptidases. Eur J Med Chem44:3266-71 (2009) 
 
Carboxypeptidase B
Name:Carboxypeptidase B
Synonyms:CPB
Type:Enzyme
Mol. Mass.:48382.46
Organism:Helicoverpa zea (Corn earworm moth) (Heliothis zea)
Description:Q3T905
Residue:429
BDBM50296428
NameBDBM50296428
TypeSmall organic molecule
Emp. Form.C21H23N3O3S
Mol. Mass.397.491
SMILESCCCN(C(=O)Cc1ccccc1OC)c1nnc(s1)-c1ccc(OC)cc1