Reaction Details
TargetCarboxypeptidase B
LigandBDBM50296424
Substrate/Competitorn/a
Meas. Tech.ChEMBL_580786 (CHEMBL1059768)
Ki 40000±n/a nM
Citation Fernández, DAvilés, FXVendrell, J A new type of five-membered heterocyclic inhibitors of basic metallocarboxypeptidases. Eur J Med Chem44:3266-71 (2009) 
 
Carboxypeptidase B
Name:Carboxypeptidase B
Synonyms:CPB
Type:Enzyme
Mol. Mass.:48382.46
Organism:Helicoverpa zea (Corn earworm moth) (Heliothis zea)
Description:Q3T905
Residue:429
BDBM50296424
NameBDBM50296424
TypeSmall organic molecule
Emp. Form.C17H13FN2O2S
Mol. Mass.328.361
SMILESCc1ccccc1-c1nnc(SCC(=O)c2ccccc2F)o1