Reaction Details
TargetCarboxypeptidase B
LigandBDBM50296434
Substrate/Competitorn/a
Meas. Tech.ChEMBL_580786 (CHEMBL1059768)
Ki 53800±n/a nM
Citation Fernández, DAvilés, FXVendrell, J A new type of five-membered heterocyclic inhibitors of basic metallocarboxypeptidases. Eur J Med Chem44:3266-71 (2009) 
 
Carboxypeptidase B
Name:Carboxypeptidase B
Synonyms:CPB
Type:Enzyme
Mol. Mass.:48382.46
Organism:Helicoverpa zea (Corn earworm moth) (Heliothis zea)
Description:Q3T905
Residue:429
BDBM50296434
NameBDBM50296434
TypeSmall organic molecule
Emp. Form.C16H11FN4O3S
Mol. Mass.358.347
SMILESOC(=O)c1cccc(c1)-n1nnnc1SCC(=O)c1ccccc1F