Reaction Details
TargetNeuronal acetylcholine receptor subunit alpha-6
LigandBDBM50119774
Substrate/Competitorn/a
Meas. Tech.ChEMBL_581328 (CHEMBL1050978)
IC50 2±n/a nM
Citation Zheng, FMcConnell, MJZhan, CGDwoskin, LPCrooks, PA QSAR study on maximal inhibition (Imax) of quaternary ammonium antagonists for S-(-)-nicotine-evoked dopamine release from dopaminergic nerve terminals in rat striatum. Bioorg Med Chem17:4477-85 (2009) 
 
Neuronal acetylcholine receptor subunit alpha-6
Name:Neuronal acetylcholine receptor subunit alpha-6
Type:PROTEIN
Mol. Mass.:56943.53
Organism:Rattus norvegicus
Description:ChEMBL_1454451
Residue:493
BDBM50119774
NameBDBM50119774
Synonyms:1,1'-(dodecane-1,12-diyl)bis(3-methylpyridinium)bromide 3-methyl-1-[6-(3-methylpyridinium-1-yl)dodecyl]pyridinium; Dibromide N,N'-(1,12-dodecandiyl)-bis-pyridinium dibromide N,N'-dodecane-1,12-diyl-bis-3-picoliniumdibromide N,N'-dodecylbis-picolinium bromide | mono(1,1'-(dodecane-1,12-diyl)bis(3-methylpyridinium))dibromide
TypeSmall organic molecule
Emp. Form.C24H38N2
Mol. Mass.354.5708
SMILESCc1ccc[n+](CCCCCCCCCCCC[n+]2cccc(C)c2)c1