Reaction Details
TargetProstaglandin E2 receptor EP3 subtype
LigandBDBM50414548
Substrate/Competitorn/a
Meas. Tech.ChEMBL_581537 (CHEMBL1059840)
Ki 7.94±n/a nM
Citation Hilfiker, MAWang, NHou, XDu, ZPullen, MANord, MNagilla, RFries, HEWu, CWSulpizio, ACJaworski, JPMorrow, DEdwards, RMJin, J Discovery of novel aminothiadiazole amides as selective EP(3) receptor antagonists. Bioorg Med Chem Lett19:4292-5 (2009) 
 
Prostaglandin E2 receptor EP3 subtype
Name:Prostaglandin E2 receptor EP3 subtype
Type:Enzyme
Mol. Mass.:43335.03
Organism:Homo sapiens (Human)
Description:P43115
Residue:390
BDBM50414548
NameBDBM50414548
Synonyms:CHEMBL550055
TypeSmall organic molecule
Emp. Form.C17H12Cl2N4O2S
Mol. Mass.407.274
SMILESClc1cccc(Cl)c1-c1nnc(NC(=O)c2ccc3OCCNc3c2)s1