Reaction Details
TargetCannabinoid receptor 1
LigandBDBM50296484
Substrate/Competitorn/a
Meas. Tech.ChEMBL_581833 (CHEMBL1064169)
Ki 560±n/a nM
Citation Hart, TMacias, ATBenwell, KBrooks, TD'Alessandro, JDokurno, PFrancis, GGibbons, BHaymes, TKennett, GLightowler, SMansell, HMatassova, NMisra, APadfield, AParsons, RPratt, RRobertson, AWalls, SWong, MRoughley, S Fatty acid amide hydrolase inhibitors. Surprising selectivity of chiral azetidine ureas. Bioorg Med Chem Lett19:4241-4 (2009) 
 
Cannabinoid receptor 1
Name:Cannabinoid receptor 1
Type:G Protein-Coupled Receptor (GPCR)
Mol. Mass.:52868.96
Organism:Homo sapiens (Human)
Description:P21554
Residue:472
BDBM50296484
NameBDBM50296484
Synonyms:(S)-{3-[(4-Chlorophenyl)-(2-chloropyridin-3-yl)methoxy]azetidin-1-yl}piperidin-1-ylmethanone VER-156084
TypeSmall organic molecule
Emp. Form.C21H23Cl2N3O2
Mol. Mass.420.332
SMILESClc1ccc(cc1)[C@H](OC1CN(C1)C(=O)N1CCCCC1)c1cccnc1Cl