Reaction Details
TargetFatty-acid amide hydrolase 1
LigandBDBM23120
Substrate/Competitorn/a
Meas. Tech.ChEMBL_581835 (CHEMBL1064171)
IC50 230±n/a nM
Citation Hart, TMacias, ATBenwell, KBrooks, TD'Alessandro, JDokurno, PFrancis, GGibbons, BHaymes, TKennett, GLightowler, SMansell, HMatassova, NMisra, APadfield, AParsons, RPratt, RRobertson, AWalls, SWong, MRoughley, S Fatty acid amide hydrolase inhibitors. Surprising selectivity of chiral azetidine ureas. Bioorg Med Chem Lett19:4241-4 (2009) 
 
Fatty-acid amide hydrolase 1
Name:Fatty-acid amide hydrolase 1
Type:Protein
Mol. Mass.:63071.19
Organism:Homo sapiens (Human)
Description:O00519
Residue:579
BDBM23120
NameBDBM23120
Synonyms:7-phenyl-1-[5-(pyridin-2-yl)-1,3-oxazol-2-yl]heptan-1-one OL-135
TypeSmall organic molecule
Emp. Form.C21H22N2O2
Mol. Mass.334.4116
SMILESO=C(CCCCCCc1ccccc1)c1ncc(o1)-c1ccccn1