Reaction Details
TargetStearoyl-CoA desaturase
LigandBDBM50296526
Substrate/Competitorn/a
Meas. Tech.ChEMBL_582073 (CHEMBL1060792)
IC50 1±n/a nM
Citation Uto, YOgata, THarada, JKiyotsuka, YUeno, YMiyazawa, YKurata, HDeguchi, TWatanabe, NTakagi, TWakimoto, SOkuyama, RAbe, MKurikawa, NKawamura, SYamato, MOsumi, J Novel and potent inhibitors of stearoyl-CoA desaturase-1. Part I: Discovery of 3-(2-hydroxyethoxy)-4-methoxy-N-[5-(3-trifluoromethylbenzyl)thiazol-2-yl]benzamide. Bioorg Med Chem Lett19:4151-8 (2009) 
 
Stearoyl-CoA desaturase
Name:Stearoyl-CoA desaturase
Type:Enzyme
Mol. Mass.:41537.27
Organism:Homo sapiens (Human)
Description:O00767
Residue:359
BDBM50296526
NameBDBM50296526
Synonyms:CHEMBL552126 | N-(5-(3,5-dichlorobenzyl)thiazol-2-yl)-3-(2-hydroxyethoxy)-4-methoxybenzamide
TypeSmall organic molecule
Emp. Form.C20H18Cl2N2O4S
Mol. Mass.453.339
SMILESCOc1ccc(cc1OCCO)C(=O)Nc1ncc(Cc2cc(Cl)cc(Cl)c2)s1