Reaction Details
TargetAcyl-CoA desaturase 1
LigandBDBM50296529
Substrate/Competitorn/a
Meas. Tech.ChEMBL_582072 (CHEMBL1060791)
IC50 1±n/a nM
Citation Uto, YOgata, THarada, JKiyotsuka, YUeno, YMiyazawa, YKurata, HDeguchi, TWatanabe, NTakagi, TWakimoto, SOkuyama, RAbe, MKurikawa, NKawamura, SYamato, MOsumi, J Novel and potent inhibitors of stearoyl-CoA desaturase-1. Part I: Discovery of 3-(2-hydroxyethoxy)-4-methoxy-N-[5-(3-trifluoromethylbenzyl)thiazol-2-yl]benzamide. Bioorg Med Chem Lett19:4151-8 (2009) 
 
Acyl-CoA desaturase 1
Name:Acyl-CoA desaturase 1
Type:PROTEIN
Mol. Mass.:41064.54
Organism:Mus musculus
Description:ChEMBL_1462109
Residue:355
BDBM50296529
NameBDBM50296529
Synonyms:CHEMBL552270 | N-(5-(3-chloro-4-fluorobenzyl)thiazol-2-yl)-3-(2-hydroxyethoxy)-4-methoxybenzamide
TypeSmall organic molecule
Emp. Form.C20H18ClFN2O4S
Mol. Mass.436.884
SMILESCOc1ccc(cc1OCCO)C(=O)Nc1ncc(Cc2ccc(F)c(Cl)c2)s1