Reaction Details
TargetATP-dependent molecular chaperone HSP82
LigandBDBM50296577
Substrate/Competitorn/a
Meas. Tech.ChEMBL_582198 (CHEMBL1059858)
IC50 24600±n/a nM
Citation Hong, TJPark, HKim, YJJeong, JHHahn, JS Identification of new Hsp90 inhibitors by structure-based virtual screening. Bioorg Med Chem Lett19:4839-42 (2009) 
 
ATP-dependent molecular chaperone HSP82
Name:ATP-dependent molecular chaperone HSP82
Type:Molecular Chaperone
Mol. Mass.:81369.08
Organism:Saccharomyces cerevisiae
Description:Histidine-tagged yeast HSP90 was transformed into E. coli and purified (>90%) by metal affinity, gel filtration, and ion-exchange chromatography.
Residue:709
BDBM50296577
NameBDBM50296577
Synonyms:5-((1-benzyl-1H-indol-3-yl)methylene)-1-(2-fluorophenyl)pyrimidine-2,4,6(1H,3H,5H)-trione | CHEMBL564184
TypeSmall organic molecule
Emp. Form.C26H18FN3O3
Mol. Mass.439.4378
SMILESFc1ccccc1N1C(=O)NC(=O)\C(=C\c2cn(Cc3ccccc3)c3ccccc23)C1=O