Reaction Details
TargetATP-dependent molecular chaperone HSP82
LigandBDBM50296578
Substrate/Competitorn/a
Meas. Tech.ChEMBL_582198 (CHEMBL1059858)
IC50 15400±n/a nM
Citation Hong, TJPark, HKim, YJJeong, JHHahn, JS Identification of new Hsp90 inhibitors by structure-based virtual screening. Bioorg Med Chem Lett19:4839-42 (2009) 
 
ATP-dependent molecular chaperone HSP82
Name:ATP-dependent molecular chaperone HSP82
Type:Molecular Chaperone
Mol. Mass.:81369.08
Organism:Saccharomyces cerevisiae
Description:Histidine-tagged yeast HSP90 was transformed into E. coli and purified (>90%) by metal affinity, gel filtration, and ion-exchange chromatography.
Residue:709
BDBM50296578
NameBDBM50296578
Synonyms:2-(5-(benzo[d][1,3]dioxol-5-yl)-4-phenyl-4H-1,2,4-triazol-3-ylthio)-1-phenylethanone | CHEMBL564708
TypeSmall organic molecule
Emp. Form.C23H17N3O3S
Mol. Mass.415.464
SMILESO=C(CSc1nnc(-c2ccc3OCOc3c2)n1-c1ccccc1)c1ccccc1