Reaction Details
TargetNociceptin receptor
LigandBDBM50296583
Substrate/Competitorn/a
Meas. Tech.ChEMBL_582240 (CHEMBL1059900)
IC50 7.8±n/a nM
Citation Kobayashi, KTsujita, TIto, HOzaki, STani, TIshii, YOkuda, STadano, KFukuroda, TOhta, HOkamoto, O Identification of MK-1925: a selective, orally active and brain-penetrable opioid receptor-like 1 (ORL1) antagonist. Bioorg Med Chem Lett19:4729-32 (2009) 
 
Nociceptin receptor
Name:Nociceptin receptor
Type:G Protein-Coupled Receptor (GPCR)
Mol. Mass.:40702.87
Organism:Homo sapiens (Human)
Description:P41146
Residue:370
BDBM50296583
NameBDBM50296583
Synonyms:(1S,3R)-3-fluoro-N-((5-(5-fluoro-6-methylpyridin-3-yl)-4-methyl-1H-pyrazol-3-yl)methyl)cyclopentanamine | CHEMBL557653
TypeSmall organic molecule
Emp. Form.C16H20F2N4
Mol. Mass.306.3536
SMILESCc1c(CN[C@H]2CC[C@@H](F)C2)[nH]nc1-c1cnc(C)c(F)c1