Reaction Details
TargetDelta-type opioid receptor
LigandBDBM50296579
Substrate/Competitorn/a
Meas. Tech.ChEMBL_582245 (CHEMBL1060813)
IC50>10000±n/a nM
Citation Kobayashi, KTsujita, TIto, HOzaki, STani, TIshii, YOkuda, STadano, KFukuroda, TOhta, HOkamoto, O Identification of MK-1925: a selective, orally active and brain-penetrable opioid receptor-like 1 (ORL1) antagonist. Bioorg Med Chem Lett19:4729-32 (2009) 
 
Delta-type opioid receptor
Name:Delta-type opioid receptor
Type:G Protein-Coupled Receptor (GPCR)
Mol. Mass.:40382.98
Organism:Homo sapiens (Human)
Description:Competition binding assays were carried out using membrane preparations from transfected HN9.10 cells that constitutively expressed the delta opioid receptor.
Residue:372
BDBM50296579
NameBDBM50296579
Synonyms:3-[5-(3,5-difluorophenyl)-3-({[(1S,3R)-3-fluorocyclopentyl]amino}-methyl)-4-methyl-1H-pyrazol-1-yl]propanenitrile MK-1925
TypeSmall organic molecule
Emp. Form.C19H21F3N4
Mol. Mass.362.392
SMILESCc1c(CN[C@H]2CC[C@@H](F)C2)nn(CCC#N)c1-c1cc(F)cc(F)c1