Reaction Details
TargetNociceptin receptor
LigandBDBM50296588
Substrate/Competitorn/a
Meas. Tech.ChEMBL_582239 (CHEMBL1059899)
IC50 210±n/a nM
Citation Kobayashi, KTsujita, TIto, HOzaki, STani, TIshii, YOkuda, STadano, KFukuroda, TOhta, HOkamoto, O Identification of MK-1925: a selective, orally active and brain-penetrable opioid receptor-like 1 (ORL1) antagonist. Bioorg Med Chem Lett19:4729-32 (2009) 
 
Nociceptin receptor
Name:Nociceptin receptor
Type:G Protein-Coupled Receptor (GPCR)
Mol. Mass.:40702.87
Organism:Homo sapiens (Human)
Description:P41146
Residue:370
BDBM50296588
NameBDBM50296588
Synonyms:(1S,3R)-3-fluoro-N-((5-(3-fluoro-5-(trifluoromethyl)phenyl)-1,4-dimethyl-1H-pyrazol-3-yl)methyl)cyclopentanamine | CHEMBL559402
TypeSmall organic molecule
Emp. Form.C18H20F5N3
Mol. Mass.373.3635
SMILESCc1c(CN[C@H]2CC[C@@H](F)C2)nn(C)c1-c1cc(F)cc(c1)C(F)(F)F