Reaction Details
TargetNociceptin receptor
LigandBDBM50296589
Substrate/Competitorn/a
Meas. Tech.ChEMBL_582239 (CHEMBL1059899)
IC50 9.3±n/a nM
Citation Kobayashi, KTsujita, TIto, HOzaki, STani, TIshii, YOkuda, STadano, KFukuroda, TOhta, HOkamoto, O Identification of MK-1925: a selective, orally active and brain-penetrable opioid receptor-like 1 (ORL1) antagonist. Bioorg Med Chem Lett19:4729-32 (2009) 
 
Nociceptin receptor
Name:Nociceptin receptor
Type:G Protein-Coupled Receptor (GPCR)
Mol. Mass.:40702.87
Organism:Homo sapiens (Human)
Description:P41146
Residue:370
BDBM50296589
NameBDBM50296589
Synonyms:(1S,3R)-N-((4-chloro-5-(3,5-difluorophenyl)-1-methyl-1H-pyrazol-3-yl)methyl)-3-fluorocyclopentanamine | CHEMBL560468
TypeSmall organic molecule
Emp. Form.C16H17ClF3N3
Mol. Mass.343.774
SMILESCn1nc(CN[C@H]2CC[C@@H](F)C2)c(Cl)c1-c1cc(F)cc(F)c1